Store ID,Store Name,source_website,brand_name,country,iso_country_code,source_url,category,store_status,store_type,store_number,store_title,address_1,address_2,address_3,city,state,zip,county,latitude,longitude,phone,toll_free,fax,email,store_website_address,store_hours,future_opening,store_open_date,serves_gas,gas_station_hours,pharmacy,pharmacy_fax,pharmacy_hours,pharmacy_phone,more_info,products_offered,services_offered,curb_pickupa,delivery_pickup,delivers_online,hours_drive_through
1,Piggly Wiggly,pigglywiggly.com,Pigglywiggly,US,US,https://www.pigglywiggly.com/store-locations/,Superstore,Open,Grocery Store,,61 Jefferson Street,61 Jefferson Street,,,Alexander City,AL,35010,US,32.94614,-85.95257,(256) 234-3454,,,,https://www.pigglywiggly.com/store-locations/alabama/,,,,,,,,,,,,,,,,
2,Piggly Wiggly,pigglywiggly.com,Pigglywiggly,US,US,https://www.pigglywiggly.com/store-locations/,Superstore,Open,Grocery Store,,104 River Square Plaza,104 River Square Plaza,,,Hueytown,AL,35023,US,33.45154,-86.9848,(205) 230-0258,,,,https://www.pigglywiggly.com/store-locations/alabama/,,,,,,,,,,,,,,,,
3,Piggly Wiggly,pigglywiggly.com,Pigglywiggly,US,US,https://www.pigglywiggly.com/store-locations/,Superstore,Open,Grocery Store,,Hwy 25 Brent Shopping Cntr,Hwy 25 Brent Shopping Cntr,,,Brent,AL,35034,US,32.91537,-87.19132,(205) 926-9720,,,,https://www.pigglywiggly.com/store-locations/alabama/,,,,,,,,,,,,,,,,
4,Piggly Wiggly,pigglywiggly.com,Pigglywiggly,US,US,https://www.pigglywiggly.com/store-locations/,Superstore,Open,Grocery Store,,1070 1St St Nw,1070 1St St Nw,,,Childersburg,AL,35044,US,33.27976,-86.35804,(256) 378-5795,,,,https://www.pigglywiggly.com/store-locations/alabama/,,,,,,,,,,,,,,,,
5,Piggly Wiggly,pigglywiggly.com,Pigglywiggly,US,US,https://www.pigglywiggly.com/store-locations/,Superstore,Open,Grocery Store,,6730 Deerfoot Parkway,6730 Deerfoot Parkway,,,Clay,AL,35048,US,33.69746,-86.60764,(205) 681-3639,,,,https://www.pigglywiggly.com/store-locations/alabama/,,,,,,,,,,,,,,,,
6,Piggly Wiggly,pigglywiggly.com,Pigglywiggly,US,US,https://www.pigglywiggly.com/store-locations/,Superstore,Open,Grocery Store,,211 W College St,211 W College St,,,Columbiana,AL,35051,US,33.17915,-86.61336,(205) 669-9916,,,,https://www.pigglywiggly.com/store-locations/alabama/,,,,,,,,,,,,,,,,
7,Piggly Wiggly,pigglywiggly.com,Pigglywiggly,US,US,https://www.pigglywiggly.com/store-locations/,Superstore,Open,Grocery Store,,2221 US HWY 78,2221 US HWY 78,,,Dora,AL,35062,US,33.75433,-87.06443,,,,,https://www.pigglywiggly.com/store-locations/alabama/,,,,,,,,,,,,,,,,
8,Piggly Wiggly,pigglywiggly.com,Pigglywiggly,US,US,https://www.pigglywiggly.com/store-locations/,Superstore,Open,Grocery Store,,470 S Main St.,470 S Main St.,,,Goodwater,AL,35072,US,33.05868,-86.05458,(256) 839-1322,,,,https://www.pigglywiggly.com/store-locations/alabama/,,,,,,,,,,,,,,,,
9,Piggly Wiggly,pigglywiggly.com,Pigglywiggly,US,US,https://www.pigglywiggly.com/store-locations/,Superstore,Open,Grocery Store,,24716 Us Hwy 31 Cobb Plaza,24716 Us Hwy 31 Cobb Plaza,,,Jemison,AL,35085,US,32.9965,-86.76688,(205) 688-2477,,,,https://www.pigglywiggly.com/store-locations/alabama/,,,,,,,,,,,,,,,,
10,Piggly Wiggly,pigglywiggly.com,Pigglywiggly,US,US,https://www.pigglywiggly.com/store-locations/,Superstore,Open,Grocery Store,,47870 US Hwy 78,47870 US Hwy 78,,,Lincoln,AL,35096,US,33.6042,-86.11657,(205) 763-7112,,,,https://www.pigglywiggly.com/store-locations/alabama/,,,,,,,,,,,,,,,,
11,Piggly Wiggly,pigglywiggly.com,Pigglywiggly,US,US,https://www.pigglywiggly.com/store-locations/,Superstore,Open,Grocery Store,,4750 Eastern Valley Road,4750 Eastern Valley Road,,,McCalla,AL,35111,US,33.32915,-86.9985,(205) 230-0142,,,,https://www.pigglywiggly.com/store-locations/alabama/,,,,,,,,,,,,,,,,
12,Piggly Wiggly,pigglywiggly.com,Pigglywiggly,US,US,https://www.pigglywiggly.com/store-locations/,Superstore,Open,Grocery Store,,100 A Council Drive,100 A Council Drive,,,Odenville,AL,35120,US,33.67535,-86.4063,(205) 629-6390,,,,https://www.pigglywiggly.com/store-locations/alabama/,,,,,,,,,,,,,,,,
13,Piggly Wiggly,pigglywiggly.com,Pigglywiggly,US,US,https://www.pigglywiggly.com/store-locations/,Superstore,Open,Grocery Store,,1351 N. Fort Williams St.,1351 N. Fort Williams St.,,,Sylacauga,AL,35150,US,33.16454,-86.27306,(256) 249-8989,,,,https://www.pigglywiggly.com/store-locations/alabama/,,,,,,,,,,,,,,,,
14,Piggly Wiggly,pigglywiggly.com,Pigglywiggly,US,US,https://www.pigglywiggly.com/store-locations/,Superstore,Open,Grocery Store,,1244 N Talladega Highway,1244 N Talladega Highway,,,Sylacauga,AL,35150,US,33.1855,-86.24437,(256) 249-4836,,,,https://www.pigglywiggly.com/store-locations/alabama/,,,,,,,,,,,,,,,,
15,Piggly Wiggly,pigglywiggly.com,Pigglywiggly,US,US,https://www.pigglywiggly.com/store-locations/,Superstore,Open,Grocery Store,,320 W Battle St,320 W Battle St,,,Talladega,AL,35160,US,33.43352,-86.10556,(256) 361-7949,,,,https://www.pigglywiggly.com/store-locations/alabama/,,,,,,,,,,,,,,,,
16,Piggly Wiggly,pigglywiggly.com,Pigglywiggly,US,US,https://www.pigglywiggly.com/store-locations/,Superstore,Open,Grocery Store,,415 Caldwell Dr,415 Caldwell Dr,,,Warrior,AL,35180,US,33.80699,-86.81045,(205) 647-3241,,,,https://www.pigglywiggly.com/store-locations/alabama/,,,,,,,,,,,,,,,,
17,Piggly Wiggly,pigglywiggly.com,Pigglywiggly,US,US,https://www.pigglywiggly.com/store-locations/,Superstore,Open,Grocery Store,,6501 1St Ave North,6501 1St Ave North,,,Birmingham,AL,35206,US,33.5484,-86.74078,(205) 592-8303,,,,https://www.pigglywiggly.com/store-locations/alabama/,,,,,,,,,,,,,,,,
18,Piggly Wiggly,pigglywiggly.com,Pigglywiggly,US,US,https://www.pigglywiggly.com/store-locations/,Superstore,Open,Grocery Store,,2500 29TH Avenue North,2500 29TH Avenue North,,,Birmingham,AL,35207,US,33.55042,-86.81907,(205) 323-5453,,,,https://www.pigglywiggly.com/store-locations/alabama/,,,,,,,,,,,,,,,,
,,,,,,,,,,,,,,,,,,,,,,,,,,,,,,,,,,,,,,,,,
Get the complete dataset from,,,,,,,,,,,,,,,,,,,,,,,,,,,,,,,,,,,,,,,,,
https://www.locationscloud.com/product/piggly-wiggly-store-locations-in-the-usa/,,,,,,,,,,,,,,,,,,,,,,,,,,,,,,,,,,,,,,,,,
