Store ID,Store Name,source_website,brand_name,country,iso_country_code,source_url,category,store_status,store_type,store_number,store_title,address_1,address_2,address_3,city,state,zip,county,latitude,longitude,phone,toll_free,fax,email,store_website_address,store_hours,future_opening,store_open_date,serves_gas,gas_station_hours,pharmacy,pharmacy_fax,pharmacy_hours,pharmacy_phone,more_info,products_offered,services_offered,curb_pickupa,delivery_pickup,delivers_online,hours_drive_through
7648,Western Branch Diesel,westernbranchdiesel.com,Western Branch Diesel,US,US,https://www.westernbranchdiesel.com/locations/,Petroleum,Open,Fuel,,Beaufort Nc,400 Sensation Weigh,,,Beaufort,NC,28516,US,34.84372449,-76.69937599,(252) 504-2185,,,,https://www.westernbranchdiesel.com/locations/beaufort-nc-branch-location/,Today: 8:00 a.m. - 5:00 p.m.,,,,,,,,,"With a 70-year tradition in excellence, we�re proud of the reputation we�ve established as a service provider and business partner. But we�re not stopping there.",,"Marine Engines, Marine Generators, Marine Transmissions",,,1,
7648,Western Branch Diesel,westernbranchdiesel.com,Western Branch Diesel,US,US,https://www.westernbranchdiesel.com/locations/,Petroleum,Open,Fuel,,Canton Oh,1616 Metric Ave Sw,,,Canton,OH,44706,US,40.80560693,-81.3928893,(330) 454-8800,,,,https://www.westernbranchdiesel.com/locations/canton-oh-branch-location/,Today: 6:00 a.m. - 6:00 p.m.,,,,,,,,,"With a 70-year tradition in excellence, we�re proud of the reputation we�ve established as a service provider and business partner. But we�re not stopping there.",,"Marine Engines, Marine Generators, Marine Transmissions",,,1,
7648,Western Branch Diesel,westernbranchdiesel.com,Western Branch Diesel,US,US,https://www.westernbranchdiesel.com/locations/,Petroleum,Open,Fuel,,Hazard Ky,1404 Ky-80,,,Hazard,KY,41701,US,37.34548432,-83.21860149,(606) 666-4981,,,,https://www.westernbranchdiesel.com/locations/hazard-ky-branch-location/,Today: 7:30 a.m. - 5:00 p.m.,,,,,,,,,"With a 70-year tradition in excellence, we�re proud of the reputation we�ve established as a service provider and business partner. But we�re not stopping there.",,"Marine Engines, Marine Generators, Marine Transmissions",,,1,
7648,Western Branch Diesel,westernbranchdiesel.com,Western Branch Diesel,US,US,https://www.westernbranchdiesel.com/locations/,Petroleum,Open,Fuel,,Portsmouth Va,3504 Shipwright St,,,Portsmouth,VA,23703,US,36.89878838,-76.35670585,(757) 673-7000,,,,https://www.westernbranchdiesel.com/locations/portsmouth-va-branch-location/,Today: 8:00 a.m. - 5:00 p.m.,,,,,,,,,"With a 70-year tradition in excellence, we�re proud of the reputation we�ve established as a service provider and business partner. But we�re not stopping there.",,"Marine Engines, Marine Generators, Marine Transmissions",,,1,
7648,Western Branch Diesel,westernbranchdiesel.com,Western Branch Diesel,US,US,https://www.westernbranchdiesel.com/locations/,Petroleum,Open,Fuel,,North Charleston Sc,6881 Bulldog Dr,,,North Charleston,SC,29406,US,32.96261366,-80.04013015,(843) 553-8331,,,,https://www.westernbranchdiesel.com/locations/hazard-ky-branch-location/,Today: 8:00 a.m. - 5:00 p.m.,,,,,,,,,"With a 70-year tradition in excellence, we�re proud of the reputation we�ve established as a service provider and business partner. But we�re not stopping there.",,"Marine Engines, Marine Generators, Marine Transmissions",,,1,
7648,Western Branch Diesel,westernbranchdiesel.com,Western Branch Diesel,US,US,https://www.westernbranchdiesel.com/locations/,Petroleum,Open,Fuel,,Ashland Va,10194 Kings Acres Rd,,,Ashland,VA,23005,US,37.77968488,-77.42172158,(804) 550-2816,,,,https://www.westernbranchdiesel.com/locations/ashland-va-branch-location/,Today: 8:00 a.m. - 5:00 p.m.,,,,,,,,,"With a 70-year tradition in excellence, we�re proud of the reputation we�ve established as a service provider and business partner. But we�re not stopping there.",,"Marine Engines, Marine Generators, Marine Transmissions",,,1,
7648,Western Branch Diesel,westernbranchdiesel.com,Western Branch Diesel,US,US,https://www.westernbranchdiesel.com/locations/,Petroleum,Open,Fuel,,Roanoke Va,4546 Thirlane Rd Nw,,,Roanoke,VA,24019,US,37.37269905,-79.99715353,(540) 362-1608,,,,https://www.westernbranchdiesel.com/locations/roanoke-va-branch-location/,Today: 8:00 a.m. - 5:00 p.m.,,,,,,,,,"With a 70-year tradition in excellence, we�re proud of the reputation we�ve established as a service provider and business partner. But we�re not stopping there.",,"Marine Engines, Marine Generators, Marine Transmissions",,,1,
7648,Western Branch Diesel,westernbranchdiesel.com,Western Branch Diesel,US,US,https://www.westernbranchdiesel.com/locations/,Petroleum,Open,Fuel,,South Charleston Wv,3100 Maccorkle Ave Sw,,,South Charleston,WV,25303,US,38.40263386,-81.69367184,(304) 744-1511,,,,https://www.westernbranchdiesel.com/locations/south-charleston-wv-branch-location/,Today: 8:00 a.m. - 5:00 p.m.,,,,,,,,,"With a 70-year tradition in excellence, we�re proud of the reputation we�ve established as a service provider and business partner. But we�re not stopping there.",,"Marine Engines, Marine Generators, Marine Transmissions",,,1,
7648,Western Branch Diesel,westernbranchdiesel.com,Western Branch Diesel,US,US,https://www.westernbranchdiesel.com/locations/,Petroleum,Open,Fuel,,St. Clairsville Oh,67755 Township Hwy 273,,,St Clairsville,OH,43950,US,40.11548518,-80.95674918,(740) 695-6301,,,,https://www.westernbranchdiesel.com/locations/roanoke-va-branch-location/,Today: 8:00 a.m. - 5:00 p.m.,,,,,,,,,"With a 70-year tradition in excellence, we�re proud of the reputation we�ve established as a service provider and business partner. But we�re not stopping there.",,"Marine Engines, Marine Generators, Marine Transmissions",,,1,
7648,Western Branch Diesel,westernbranchdiesel.com,Western Branch Diesel,US,US,https://www.westernbranchdiesel.com/locations/,Petroleum,Open,Fuel,,Wilmington Nc,2017 Corporate Drive Suite 9,,,Wilmington,NC,28405,US,34.34248366,-77.86074315,(910) 685-7590,,,,https://www.westernbranchdiesel.com/locations/wilmington-nc-branch-location/,Today: 8:00 a.m. - 5:00 p.m.,,,,,,,,,"With a 70-year tradition in excellence, we�re proud of the reputation we�ve established as a service provider and business partner. But we�re not stopping there.",,"Marine Engines, Marine Generators, Marine Transmissions",,,1,
,,,,,,,,,,,,,,,,,,,,,,,,,,,,,,,,,,,,,,,,,
Get the complete dataset from,,,,,,,,,,,,,,,,,,,,,,,,,,,,,,,,,,,,,,,,,
https://www.locationscloud.com/product/western-branch-diesel-locations-in-the-usa/,,,,,,,,,,,,,,,,,,,,,,,,,,,,,,,,,,,,,,,,,
