Store ID,Store Name,source_website,brand_name,country,iso_country_code,source_url,category,store_status,store_type,store_number,store_title,address_1,address_2,address_3,city,state,zip,county,latitude,longitude,phone,toll_free,fax,email,store_website_address,store_hours,future_opening,store_open_date,serves_gas,gas_station_hours,pharmacy,pharmacy_fax,pharmacy_hours,pharmacy_phone,more_info,products_offered,services_offered,curb_pickupa,delivery_pickup,delivers_online,hours_drive_through
7584,Fisher Auto Parts,fisherautoparts.com,Fisherautoparts,US,US,http:/www.fisherautoparts.com/fisher-store-locator.aspx/,Automobile,Open,Auto Parts,,Fisher Auto Parts,1186 N Mildred St,Ste 104,,Ranson,WV,25438,US,39.31056592,-77.863631,(304) 728-6173,,,,https://www.fisherautoparts.com/fisher-store-locator.aspx,,,,,,,,,,,,,,,,
7584,Fisher Auto Parts,fisherautoparts.com,Fisherautoparts,US,US,http:/www.fisherautoparts.com/fisher-store-locator.aspx/,Automobile,Open,Auto Parts,,Fisher Auto Parts,40 Kimble Rd,Ste A,,Berryville,VA,22611,US,42.26136704,-76.91483057,(540) 955-1962,,,,https://www.fisherautoparts.com/fisher-store-locator.aspx,,,,,,,,,,,,,,,,
7584,Fisher Auto Parts,fisherautoparts.com,Fisherautoparts,US,US,http:/www.fisherautoparts.com/fisher-store-locator.aspx/,Automobile,Open,Auto Parts,,Fisher Auto Parts,14723 Baltimore Ave,Ste C,,Laurel,MD,20707,US,39.092318,-76.85619582,(410) 792-0185,,,,https://www.fisherautoparts.com/fisher-store-locator.aspx,,,,,,,,,,,,,,,,
7584,Fisher Auto Parts,fisherautoparts.com,Fisherautoparts,US,US,http:/www.fisherautoparts.com/fisher-store-locator.aspx/,Automobile,Open,Auto Parts,,Fisher Auto Parts,2774 Old Washington Rd,Unit B3,,Waldorf,MD,20601,US,39.49748827,-76.999077,(301) 645-5851,,,,https://www.fisherautoparts.com/fisher-store-locator.aspx,,,,,,,,,,,,,,,,
7584,Fisher Auto Parts,fisherautoparts.com,Fisherautoparts,US,US,http:/www.fisherautoparts.com/fisher-store-locator.aspx/,Automobile,Open,Auto Parts,,Fisher Auto Parts,1430 Progress Way,Ste 101-102,,Eldersburg,MD,21784,US,39.4129258,-76.9448359,(410) 552-5022,,,,https://www.fisherautoparts.com/fisher-store-locator.aspx,,,,,,,,,,,,,,,,
7584,Fisher Auto Parts,fisherautoparts.com,Fisherautoparts,US,US,http:/www.fisherautoparts.com/fisher-store-locator.aspx/,Automobile,Open,Auto Parts,,Fisher Auto Parts,4404 Lafayette Blvd,,,Fredericksburg,VA,22408,US,38.25888949,-77.49338541,(540) 898-4841,,,,https://www.fisherautoparts.com/fisher-store-locator.aspx,,,,,,,,,,,,,,,,
7584,Fisher Auto Parts,fisherautoparts.com,Fisherautoparts,US,US,http:/www.fisherautoparts.com/fisher-store-locator.aspx/,Automobile,Open,Auto Parts,,Fisher Auto Parts,1203 S Main St,,,Culpeper,VA,22701,US,38.46606,-77.99848,(540) 825-5250,,,,https://www.fisherautoparts.com/fisher-store-locator.aspx,,,,,,,,,,,,,,,,
7584,Fisher Auto Parts,fisherautoparts.com,Fisherautoparts,US,US,http:/www.fisherautoparts.com/fisher-store-locator.aspx/,Automobile,Open,Auto Parts,,Fisher Auto Parts,29066 Three Notch Rd,,,Mechanicsville,MD,20659,US,38.46572038,-76.77027217,(301) 884-5281,,,,https://www.fisherautoparts.com/fisher-store-locator.aspx,,,,,,,,,,,,,,,,
7584,Fisher Auto Parts,fisherautoparts.com,Fisherautoparts,US,US,http:/www.fisherautoparts.com/fisher-store-locator.aspx/,Automobile,Open,Auto Parts,,Fisher Auto Parts,1941 S Loudoun St,,,Winchester,VA,22601,US,39.16548349,-78.17178404,(540) 723-0419,,,,https://www.fisherautoparts.com/fisher-store-locator.aspx,,,,,,,,,,,,,,,,
7584,Fisher Auto Parts,fisherautoparts.com,Fisherautoparts,US,US,http:/www.fisherautoparts.com/fisher-store-locator.aspx/,Automobile,Open,Auto Parts,,Fisher Auto Parts,32 Sue Ct,,,Martinsburg,WV,25405,US,32.60713825,-97.15221863,(304) 267-2961,,,,https://www.fisherautoparts.com/fisher-store-locator.aspx,,,,,,,,,,,,,,,,
7584,Fisher Auto Parts,fisherautoparts.com,Fisherautoparts,US,US,http:/www.fisherautoparts.com/fisher-store-locator.aspx/,Automobile,Open,Auto Parts,,Fisher Auto Parts,435 E Baltimore St,,,Hagerstown,MD,21740,US,35.613419,-88.81488874,(301) 790-9767,,,,https://www.fisherautoparts.com/fisher-store-locator.aspx,,,,,,,,,,,,,,,,
7584,Fisher Auto Parts,fisherautoparts.com,Fisherautoparts,US,US,http:/www.fisherautoparts.com/fisher-store-locator.aspx/,Automobile,Open,Auto Parts,,Fisher Auto Parts,15 E Luray Shopping Ctr,,,Luray,VA,22835,US,38.664896,-78.44699504,(540) 743-5139,,,,https://www.fisherautoparts.com/fisher-store-locator.aspx,,,,,,,,,,,,,,,,
7584,Fisher Auto Parts,fisherautoparts.com,Fisherautoparts,US,US,http:/www.fisherautoparts.com/fisher-store-locator.aspx/,Automobile,Open,Auto Parts,,Fisher Auto Parts,1370 Blair Dr Ste G,,,Odenton,MD,21113,US,39.09085,-76.70331,(410) 551-9166,,,,https://www.fisherautoparts.com/fisher-store-locator.aspx,,,,,,,,,,,,,,,,
7584,Fisher Auto Parts,fisherautoparts.com,Fisherautoparts,US,US,http:/www.fisherautoparts.com/fisher-store-locator.aspx/,Automobile,Open,Auto Parts,,Fisher Auto Parts,9740 Jefferson Davis Hwy,,,Richmond,VA,23237,US,36.8475356,-87.32519724,(804) 743-2580,,,,https://www.fisherautoparts.com/fisher-store-locator.aspx,,,,,,,,,,,,,,,,
7584,Fisher Auto Parts,fisherautoparts.com,Fisherautoparts,US,US,http:/www.fisherautoparts.com/fisher-store-locator.aspx/,Automobile,Open,Auto Parts,,Fisher Auto Parts,8129 Connor Rd,Ste A,,Mechanicsville,VA,23111,US,37.5992408,-77.37969849,(804) 559-2641,,,,https://www.fisherautoparts.com/fisher-store-locator.aspx,,,,,,,,,,,,,,,,
7584,Fisher Auto Parts,fisherautoparts.com,Fisherautoparts,US,US,http:/www.fisherautoparts.com/fisher-store-locator.aspx/,Automobile,Open,Auto Parts,,Fisher Auto Parts,12621 Genito Rd,,,Midlothian,VA,23112,US,37.44830165,-77.6262127,(804) 763-2625,,,,https://www.fisherautoparts.com/fisher-store-locator.aspx,,,,,,,,,,,,,,,,
7584,Fisher Auto Parts,fisherautoparts.com,Fisherautoparts,US,US,http:/www.fisherautoparts.com/fisher-store-locator.aspx/,Automobile,Open,Auto Parts,,Fisher Auto Parts,8400 Sanford Dr,,,Richmond,VA,23228,US,37.6271899,-77.5023992,(804) 262-2163,,,,https://www.fisherautoparts.com/fisher-store-locator.aspx,,,,,,,,,,,,,,,,
7584,Fisher Auto Parts,fisherautoparts.com,Fisherautoparts,US,US,http:/www.fisherautoparts.com/fisher-store-locator.aspx/,Automobile,Open,Auto Parts,,Fisher Auto Parts,11475 Fox Cross Rd,,,Ashland,VA,23005,US,37.72003468,-77.46187848,(804) 798-5714,,,,https://www.fisherautoparts.com/fisher-store-locator.aspx,,,,,,,,,,,,,,,,
7584,Fisher Auto Parts,fisherautoparts.com,Fisherautoparts,US,US,http:/www.fisherautoparts.com/fisher-store-locator.aspx/,Automobile,Open,Auto Parts,,Fisher Auto Parts,100 W Elk Ave,,,Elizabethton,TN,37643,US,36.349665,-82.224875,(423) 777-6776,,,,https://www.fisherautoparts.com/fisher-store-locator.aspx,,,,,,,,,,,,,,,,
,,,,,,,,,,,,,,,,,,,,,,,,,,,,,,,,,,,,,,,,,
Get the complete dataset from,,,,,,,,,,,,,,,,,,,,,,,,,,,,,,,,,,,,,,,,,
https://www.locationscloud.com/product/fisher-auto-parts-locations-in-the-usa/,,,,,,,,,,,,,,,,,,,,,,,,,,,,,,,,,,,,,,,,,
