Store ID,Store Name,source_website,brand_name,country,iso_country_code,source_url,category,store_status,store_type,store_number,store_title,address_1,address_2,address_3,city,state,zip,county,latitude,longitude,phone,toll_free,fax,email,store_website_address,store_hours,future_opening,store_open_date,serves_gas,gas_station_hours,pharmacy,pharmacy_fax,pharmacy_hours,pharmacy_phone,more_info,products_offered,services_offered,curb_pickupa,delivery_pickup,delivers_online,hours_drive_through
7176,Domino's Pizza,pizza.dominos.com,Dominos,US,US,https://pizza.dominos.com/michigan/novi,Restaurants,Open,Pizzas,5713,Domino'S,5207 Memorial Drive,,,Stone Mountain,GA,30083,US,33.79745232,-84.22374345,(404) 297-3030,,,,https://pizza.dominos.com/georgia/stone-mountain/5207-memorial-drive/,Mon-Thu10:30 am to 12:00 am Fri-Sat10:30 am to 1:00 am Sun10:30 am to 12:00 am,,,,,,,,,,,,,,1,
7176,Domino's Pizza,pizza.dominos.com,Dominos,US,US,https://pizza.dominos.com/michigan/novi,Restaurants,Open,Pizzas,3589,Domino'S,7580 Springbox Drive,Suite 110,,Fairburn,GA,30213,US,33.6405963,-84.63781936,(999) 999-9999,,,,https://pizza.dominos.com/georgia/fairburn/7580-springbox-drive-suite-110/,Mon-Thu10:30 am to 12:00 am Fri-Sat10:30 am to 1:00 am Sun10:30 am to 12:00 am,,,,,,,,,,,,,,1,
7176,Domino's Pizza,pizza.dominos.com,Dominos,US,US,https://pizza.dominos.com/michigan/novi,Restaurants,Open,Pizzas,5730,Domino'S,1839 Mt Zion Road,,,Morrow,GA,30260,US,36.36678107,-87.01689989,(770) 960-3030,,,,https://pizza.dominos.com/georgia/morrow/1839-mt-zion-road/,Mon-Thu10:00 am to 12:00 am Fri-Sat10:00 am to 1:00 am Sun10:00 am to 12:00 am,,,,,,,,,,,,,,1,
7176,Domino's Pizza,pizza.dominos.com,Dominos,US,US,https://pizza.dominos.com/michigan/novi,Restaurants,Open,Pizzas,4184,Domino'S,228 Fairview Rd,,,Ellenwood,GA,30294,US,38.65395154,-84.52978957,(770) 389-9300,,,,https://pizza.dominos.com/georgia/ellenwood/228-fairview-rd/,Mon-Thu10:00 am to 12:00 am Fri-Sat10:00 am to 1:00 am Sun10:00 am to 12:00 am,,,,,,,,,,,,,,1,
7176,Domino's Pizza,pizza.dominos.com,Dominos,US,US,https://pizza.dominos.com/michigan/novi,Restaurants,Open,Pizzas,4142,Domino'S,5860 Jimmy Carter Blvd,,,Norcross,GA,30071,US,33.92255057,-84.21274032,(678) 274-5656,,,,https://pizza.dominos.com/georgia/norcross/5860-jimmy-carter-blvd/,Mon-Thu10:30 am to 12:00 am Fri-Sat10:30 am to 1:00 am Sun10:30 am to 12:00 am,,,,,,,,,,,,,,1,
7176,Domino's Pizza,pizza.dominos.com,Dominos,US,US,https://pizza.dominos.com/michigan/novi,Restaurants,Open,Pizzas,4141,Domino'S,3300 Buford Highway,,,Atlanta,GA,30329,US,34.13763318,-84.10222691,(404) 633-3231,,,,https://pizza.dominos.com/georgia/atlanta/3300-buford-highway/,Mon-Thu10:00 am to 12:00 am Fri-Sat10:00 am to 1:00 am Sun10:00 am to 12:00 am,,,,,,,,,,,,,,1,
7176,Domino's Pizza,pizza.dominos.com,Dominos,US,US,https://pizza.dominos.com/michigan/novi,Restaurants,Open,Pizzas,8876,Domino'S,530 Joseph E Lowery Blvd,Suite F,,Atlanta,GA,30310,US,33.76948859,-84.41750083,(404) 917-1818,,,,https://pizza.dominos.com/georgia/atlanta/530-joseph-e-lowery-blvd-suite-f/,Mon-Thu10:30 am to 12:00 am Fri-Sat10:30 am to 1:00 am Sun10:30 am to 12:00 am,,,,,,,,,,,,,,1,
7176,Domino's Pizza,pizza.dominos.com,Dominos,US,US,https://pizza.dominos.com/michigan/novi,Restaurants,Open,Pizzas,5708,Domino'S,955 Marietta St`,,,Atlanta,GA,30318,US,33.77862,-84.4091326,(404) 872-3000,,,,https://pizza.dominos.com/georgia/atlanta/955-marietta-st/,Mon-Thu10:00 am to 12:00 am Fri-Sat10:00 am to 1:00 am Sun10:00 am to 12:00 am,,,,,,,,,,,,,,1,
7176,Domino's Pizza,pizza.dominos.com,Dominos,US,US,https://pizza.dominos.com/michigan/novi,Restaurants,Open,Pizzas,5738,Domino'S,465 Boulevard Se,,,Atlanta,GA,48446,US,33.7419631,-84.3685912,(470) 571-0101,,,,https://pizza.dominos.com/georgia/atlanta/465-boulevard-se/,Mon-Thu10:30 am to 12:00 am Fri-Sat10:30 am to 1:00 am Sun10:30 am to 12:00 am,,,,,,,,,,,,,,1,
7176,Domino's Pizza,pizza.dominos.com,Dominos,US,US,https://pizza.dominos.com/michigan/novi,Restaurants,Open,Pizzas,5758,Domino'S,1195 Fairburn Rd,Suite 110,,Atlanta,GA,30331,US,33.7224,-84.5095,(404) 344-3435,,,,https://pizza.dominos.com/georgia/atlanta/1195-fairburn-rd-suite-110/,Mon-Thu10:30 am to 12:00 am Fri-Sat10:30 am to 1:00 am Sun10:30 am to 12:00 am,,,,,,,,,,,,,,1,
7176,Domino's Pizza,pizza.dominos.com,Dominos,US,US,https://pizza.dominos.com/michigan/novi,Restaurants,Open,Pizzas,5726,Domino'S,2165 Cheshire Bridge Rd Ne,,,Atlanta,GA,30324,US,36.0880586,-78.9303826,(404) 636-5164,,,,https://pizza.dominos.com/georgia/atlanta/2165-cheshire-bridge-rd-ne/,Mon-Thu10:00 am to 12:00 am Fri-Sat10:00 am to 1:00 am Sun10:00 am to 12:00 am,,,,,,,,,,,,,,1,
7176,Domino's Pizza,pizza.dominos.com,Dominos,US,US,https://pizza.dominos.com/michigan/novi,Restaurants,Open,Pizzas,4150,Domino'S,515 N Central Avenue,,,Hapeville,GA,30354,US,28.67861617,-81.20858725,(404) 669-2666,,,,https://pizza.dominos.com/georgia/hapeville/515-n-central-avenue/,Mon-Thu10:00 am to 12:00 am Fri-Sat10:00 am to 1:00 am Sun10:00 am to 12:00 am,,,,,,,,,,,,,,1,
7176,Domino's Pizza,pizza.dominos.com,Dominos,US,US,https://pizza.dominos.com/michigan/novi,Restaurants,Open,Pizzas,5744,Domino'S,6274 Mableton Pkwy,,,Mableton,GA,30126,US,33.8144486,-84.5726225,(770) 941-2959,,,,https://pizza.dominos.com/georgia/mableton/6274-mableton-pkwy/,Mon-Thu10:00 am to 12:00 am Fri-Sat10:00 am to 1:00 am Sun10:00 am to 12:00 am,,,,,,,,,,,,,,1,
7176,Domino's Pizza,pizza.dominos.com,Dominos,US,US,https://pizza.dominos.com/michigan/novi,Restaurants,Open,Pizzas,8967,Domino'S,2520 Se Bouldercrest Rd,,,Atlanta,GA,30316,US,33.68784632,-84.31058421,(404) 241-7900,,,,https://pizza.dominos.com/georgia/atlanta/2520-se-bouldercrest-rd/,Mon-Thu10:30 am to 12:00 am Fri-Sat10:30 am to 1:00 am Sun10:30 am to 12:00 am,,,,,,,,,,,,,,1,
7176,Domino's Pizza,pizza.dominos.com,Dominos,US,US,https://pizza.dominos.com/michigan/novi,Restaurants,Open,Pizzas,5711,Domino'S,5819 Campbellton Road,Ste 106,,Atlanta,GA,30331,US,33.6997545,-84.5786098,(404) 564-3300,,,,https://pizza.dominos.com/georgia/atlanta/5819-campbellton-road-ste-106/,Mon-Thu10:30 am to 12:00 am Fri-Sat10:30 am to 1:00 am Sun10:30 am to 12:00 am,,,,,,,,,,,,,,1,
7176,Domino's Pizza,pizza.dominos.com,Dominos,US,US,https://pizza.dominos.com/michigan/novi,Restaurants,Open,Pizzas,5745,Domino'S,3333-A S Cobb Dr Se,,,Smyrna,GA,30080,US,33.87271,-84.52904,(770) 436-0787,,,,https://pizza.dominos.com/georgia/smyrna/3333-a-s-cobb-dr-se/,Mon-Thu10:30 am to 12:00 am Fri-Sat10:30 am to 1:00 am Sun10:30 am to 12:00 am,,,,,,,,,,,,,,1,
7176,Domino's Pizza,pizza.dominos.com,Dominos,US,US,https://pizza.dominos.com/michigan/novi,Restaurants,Open,Pizzas,5709,Domino'S,1303 Columbia Dr,,,Decatur,GA,30032,US,32.5110353,-94.7560475,(404) 284-2122,,,,https://pizza.dominos.com/georgia/decatur/1303-columbia-dr/,Mon-Thu10:30 am to 11:00 pm Fri-Sat10:30 am to 12:00 am Sun10:30 am to 11:00 pm,,,,,,,,,,,,,,1,
7176,Domino's Pizza,pizza.dominos.com,Dominos,US,US,https://pizza.dominos.com/michigan/novi,Restaurants,Open,Pizzas,4127,Domino'S,639 Thornton Rd #104,,,Lithia Springs,GA,30122,US,33.78703,-84.61929,(678) 945-3990,,,,https://pizza.dominos.com/georgia/lithia-springs/639-thornton-rd-104/,Mon-Thu10:00 am to 12:00 am Fri-Sat10:00 am to 1:00 am Sun10:00 am to 12:00 am,,,,,,,,,,,,,,1,
7176,Domino's Pizza,pizza.dominos.com,Dominos,US,US,https://pizza.dominos.com/michigan/novi,Restaurants,Open,Pizzas,5700,Domino'S,4763 Buford Hwy,,,Atlanta,GA,30341,US,33.88039672,-84.29104417,(770) 458-2604,,,,https://pizza.dominos.com/georgia/atlanta/4763-buford-hwy/,Mon-Thu10:00 am to 12:00 am Fri-Sat10:00 am to 1:00 am Sun10:00 am to 12:00 am,,,,,,,,,,,,,,1,
7176,Domino's Pizza,pizza.dominos.com,Dominos,US,US,https://pizza.dominos.com/michigan/novi,Restaurants,Open,Pizzas,1010,Domino'S,41728 West 10 Mile Road,,,Novi,MI,48375,US,42.4672067,-83.45870561,(248) 349-9101,,,,https://pizza.dominos.com/michigan/novi/41728-west-10-mile-road/,Mon-Thu10:30 am to 12:00 am Fri-Sat10:30 am to 1:00 am Sun10:30 am to 12:00 am,,,,,,,,,,,,,,1,
,,,,,,,,,,,,,,,,,,,,,,,,,,,,,,,,,,,,,,,,,
Get the complete dataset from,,,,,,,,,,,,,,,,,,,,,,,,,,,,,,,,,,,,,,,,,
https://www.locationscloud.com/product/dominos-pizza-locations-in-the-usa/,,,,,,,,,,,,,,,,,,,,,,,,,,,,,,,,,,,,,,,,,
