Get the complete dataset from,Store Name,source_website,brand_name,country,iso_country_code,source_url,category,store_status,store_type,store_number,store_title,address_1,address_2,address_3,city,state,zip,county,latitude,longitude,phone,toll_free,fax,email,store_website_address,store_hours,future_opening,store_open_date,serves_gas,gas_station_hours,pharmacy,pharmacy_fax,pharmacy_hours,pharmacy_phone,more_info,products_offered,services_offered,curb_pickupa,delivery_pickup,delivers_online,hours_drive_through
https://www.locationscloud.com/product/speedway-gas-station-locations-in-the-usa/,Speedway gas station,speedway.com,Speedway,US,US,https://www.speedway.com/locations,Petroleum,Open,Fuel,4704,Speedway,23087 Hwy 13,,,Albert Lea,MN,56007-0000,US,43.68807656,-93.42068682,(507) 377-2230,,,,https://www.speedway.com/locations/MN/Albert-Lea/23087-Hwy-13,Open 24 Hours,,,1,,,,,,"At Speedway, with nearly every purchase�candy bars, drinks, you name it�you earn points toward free fuel and food, merchandise & gift cards!","Plus, Premium, Unleaded, Auto Diesel",Open 24 Hours,,1,,
6624,Speedway gas station,speedway.com,Speedway,US,US,https://www.speedway.com/locations,Petroleum,Open,Fuel,7027,Speedway,201 Webster Avenue,,,North Mankato,MN,56003-2219,US,44.18092253,-94.00827004,(507) 625-2901,,,,https://www.speedway.com/locations/MN/North-Mankato/201-Webster-Avenue,Open 24 Hours,,,1,,,,,,"At Speedway, with nearly every purchase�candy bars, drinks, you name it�you earn points toward free fuel and food, merchandise & gift cards!","Plus, Premium, Unleaded, Auto Diesel",Open 24 Hours | Money Orders | Bill Pay,,1,,
6624,Speedway gas station,speedway.com,Speedway,US,US,https://www.speedway.com/locations,Petroleum,Open,Fuel,4707,Speedway,307 North State Street,,,Fairmont,MN,56031-0000,US,43.65538378,-94.44776597,(507) 235-5856,,,,https://www.speedway.com/locations/MN/Fairmont/307-North-State-Street,,,,1,,,,,,"At Speedway, with nearly every purchase�candy bars, drinks, you name it�you earn points toward free fuel and food, merchandise & gift cards!","Plus, Premium, Unleaded, Auto Diesel",,,1,,
6624,Speedway gas station,speedway.com,Speedway,US,US,https://www.speedway.com/locations,Petroleum,Open,Fuel,4709,Speedway,2197 North State Street,,,Fairmont,MN,56031-0000,US,43.67597566,-94.44897091,(507) 235-8424,,,,https://www.speedway.com/locations/MN/Fairmont/2197-North-State-Street,Open 24 Hours,,,1,,,,,,"At Speedway, with nearly every purchase�candy bars, drinks, you name it�you earn points toward free fuel and food, merchandise & gift cards!","Plus, Premium, Unleaded, Auto Diesel",Open 24 Hours,,1,,
6624,Speedway gas station,speedway.com,Speedway,US,US,https://www.speedway.com/locations,Petroleum,Open,Fuel,4703,Speedway,514 Third Street,,,Jackson,MN,56143-0000,US,43.62223011,-94.98837237,(507) 847-9999,,,,https://www.speedway.com/locations/MN/Jackson/514-Third-Street,,,,1,,,,,,"At Speedway, with nearly every purchase�candy bars, drinks, you name it�you earn points toward free fuel and food, merchandise & gift cards!","Plus, Unleaded",,,1,,
6624,Speedway gas station,speedway.com,Speedway,US,US,https://www.speedway.com/locations,Petroleum,Open,Fuel,4701,Speedway,2001 Hwy 71 North,,,Jackson,MN,56143-0000,US,43.64188655,-94.99614871,(507) 847-3621,,,,https://www.speedway.com/locations/MN/Jackson/2001-Hwy-71-North,Open 24 Hours,,,1,,,,,,"At Speedway, with nearly every purchase�candy bars, drinks, you name it�you earn points toward free fuel and food, merchandise & gift cards!","Plus, Premium, Unleaded, Auto Diesel",Open 24 Hours,,1,,
6624,Speedway gas station,speedway.com,Speedway,US,US,https://www.speedway.com/locations,Petroleum,Open,Fuel,4710,Speedway,1550 Hwy 60 & 71,,,Windom,MN,56101-0000,US,43.87267682,-95.11408942,(507) 831-1576,,,,https://www.speedway.com/locations/MN/Windom/1550-Hwy-60-&-71,,,,1,,,,,,"At Speedway, with nearly every purchase�candy bars, drinks, you name it�you earn points toward free fuel and food, merchandise & gift cards!","Unleaded, Plus, Premium, Truck Diesel, Auto Diesel",Open 24 Hours,,1,,
6624,Speedway gas station,speedway.com,Speedway,US,US,https://www.speedway.com/locations,Petroleum,Open,Fuel,4824,Speedway,15 1St Avenue,,,Clara City,MN,56222-0000,US,44.95512133,-95.36568505,(320) 847-3567,,,,https://www.speedway.com/locations/MN/Clara-City/15-1st-Avenue,,,,1,,,,,,"At Speedway, with nearly every purchase�candy bars, drinks, you name it�you earn points toward free fuel and food, merchandise & gift cards!","Plus, Premium, Unleaded",,,1,,
6624,Speedway gas station,speedway.com,Speedway,US,US,https://www.speedway.com/locations,Petroleum,Open,Fuel,4298,Speedway,2911 W 41St St,,,Sioux Falls,SD,57105-4256,US,43.51468959,-96.76219644,(605) 335-1150,,,,https://www.speedway.com/locations/SD/Sioux-Falls/2911-W-41st-St,,,,1,,,,,,"At Speedway, with nearly every purchase�candy bars, drinks, you name it�you earn points toward free fuel and food, merchandise & gift cards!","Ethanol Free, Plus, Unleaded, Auto Diesel",Money Orders | Bill Pay,,1,,
6624,Speedway gas station,speedway.com,Speedway,US,US,https://www.speedway.com/locations,Petroleum,Open,Fuel,4706,Speedway,2001 E. King Street,,,Chamberlain,SD,57325-0000,US,43.76839485,-99.31292198,(605) 734-5888,,,,https://www.speedway.com/locations/SD/Chamberlain/2001-E-King-Street,,,,1,,,,,,"At Speedway, with nearly every purchase�candy bars, drinks, you name it�you earn points toward free fuel and food, merchandise & gift cards!","Plus, Unleaded, Auto Diesel",Open 24 Hours,,1,,
6624,Speedway gas station,speedway.com,Speedway,US,US,https://www.speedway.com/locations,Petroleum,Open,Fuel,4797,Speedway,503 2Nd Street,,,Kenyon,MN,55946-0000,US,44.27185859,-92.98850111,(507) 789-6201,,,,https://www.speedway.com/locations/MN/Kenyon/503-2nd-Street,,,,1,,,,,,"At Speedway, with nearly every purchase�candy bars, drinks, you name it�you earn points toward free fuel and food, merchandise & gift cards!","Ethanol Free, Unleaded, Auto Diesel",,,1,,
6624,Speedway gas station,speedway.com,Speedway,US,US,https://www.speedway.com/locations,Petroleum,Open,Fuel,4610,Speedway,2519 Lyndale Ave N,,,Faribault,MN,55021-2612,US,44.31741136,-93.29468593,(507) 334-3333,,,,https://www.speedway.com/locations/MN/Faribault/2519-Lyndale-Ave-N,,,,1,,,,,,"At Speedway, with nearly every purchase�candy bars, drinks, you name it�you earn points toward free fuel and food, merchandise & gift cards!","Def, Plus, Premium, Unleaded, Auto Diesel, Truck Diesel",Open 24 Hours | 6 Diesel Fuel Lanes | Truck Scale | Money Orders | Bill Pay,,1,,
6624,Speedway gas station,speedway.com,Speedway,US,US,https://www.speedway.com/locations,Petroleum,Open,Fuel,4799,Speedway,435 Mian Street,,,New Prague,MN,56071-0000,US,44.54401629,-93.58460358,(952) 758-6767,,,,https://www.speedway.com/locations/MN/New-Prague/435-Mian-Street,,,,1,,,,,,"At Speedway, with nearly every purchase�candy bars, drinks, you name it�you earn points toward free fuel and food, merchandise & gift cards!","Plus, Premium, Unleaded, Auto Diesel",,,1,,
6624,Speedway gas station,speedway.com,Speedway,US,US,https://www.speedway.com/locations,Petroleum,Open,Fuel,4708,Speedway,205 N. Main St.,,,Le Sueur,MN,56058-0000,US,44.4627365,-93.91428138,(507) 665-6800,,,,https://www.speedway.com/locations/MN/Le-Sueur/205-N-Main-St,,,,1,,,,,,"At Speedway, with nearly every purchase�candy bars, drinks, you name it�you earn points toward free fuel and food, merchandise & gift cards!","Plus, Unleaded, Auto Diesel",,,1,,
6624,Speedway gas station,speedway.com,Speedway,US,US,https://www.speedway.com/locations,Petroleum,Open,Fuel,4141,Speedway,123 St. Julien Street,,,St. Peter,MN,56082-1877,US,44.34031051,-93.94948012,(507) 931-9477,,,,https://www.speedway.com/locations/MN/St-Peter/123-St-Julien-Street,,,,1,,,,,,"At Speedway, with nearly every purchase�candy bars, drinks, you name it�you earn points toward free fuel and food, merchandise & gift cards!","Plus, Premium, Unleaded, Auto Diesel",Open 24 Hours | Money Orders | Car Wash | Bill Pay,,1,,
6624,Speedway gas station,speedway.com,Speedway,US,US,https://www.speedway.com/locations,Petroleum,Open,Fuel,4783,Speedway,640 Hwy 7 E,,,Hutchinson,MN,55350-0000,US,44.89531145,-94.3504465,(320) 587-8259,,,,https://www.speedway.com/locations/MN/Hutchinson/640-Hwy-7-E,,,,1,,,,,,"At Speedway, with nearly every purchase�candy bars, drinks, you name it�you earn points toward free fuel and food, merchandise & gift cards!","Ethanol Free, Unleaded, Premium, Auto Diesel",,,1,,
6624,Speedway gas station,speedway.com,Speedway,US,US,https://www.speedway.com/locations,Petroleum,Open,Fuel,4315,Speedway,1210 Highway 7 W,,,Hutchinson,MN,55350-1421,US,44.89324855,-94.39556014,(320) 587-6223,,,,https://www.speedway.com/locations/MN/Hutchinson/1210-Highway-7-W,Open 24 Hours,,,1,,,,,,"At Speedway, with nearly every purchase�candy bars, drinks, you name it�you earn points toward free fuel and food, merchandise & gift cards!","Plus, Premium, Unleaded, Auto Diesel",Open 24 Hours | Money Orders | Bill Pay,,1,,
6624,Speedway gas station,speedway.com,Speedway,US,US,https://www.speedway.com/locations,Petroleum,Open,Fuel,4749,Speedway,325 S. Sibley,,,Litchfield,MN,55355-0000,US,45.12296808,-94.52793237,(320) 693-7595,,,,https://www.speedway.com/locations/MN/Litchfield/325-S-Sibley,,,,1,,,,,,"At Speedway, with nearly every purchase�candy bars, drinks, you name it�you earn points toward free fuel and food, merchandise & gift cards!","Plus, Premium, Unleaded",,,1,,
6624,Speedway gas station,speedway.com,Speedway,US,US,https://www.speedway.com/locations,Petroleum,Open,Fuel,4213,Speedway,415 1St St S,,,Willmar,MN,56201-3305,US,45.12052838,-95.04312084,(320) 235-6225,,,,https://www.speedway.com/locations/MN/Willmar/415-1st-St-S,,,,1,,,,,,"At Speedway, with nearly every purchase�candy bars, drinks, you name it�you earn points toward free fuel and food, merchandise & gift cards!","Plus, Premium, Unleaded, Auto Diesel",Open 24 Hours | Money Orders | Bill Pay,,1,,
6624,Speedway gas station,speedway.com,Speedway,US,US,https://www.speedway.com/locations,Petroleum,Open,Fuel,4748,Speedway,608 Atlantic Avenue,,,Kerkhoven,MN,56252-0000,US,45.18940427,-95.31257142,(320) 264-1246,,,,https://www.speedway.com/locations/MN/Kerkhoven/608-Atlantic-Avenue,,,,1,,,,,,"At Speedway, with nearly every purchase�candy bars, drinks, you name it�you earn points toward free fuel and food, merchandise & gift cards!","Ethanol Free, Plus, Premium, Unleaded, Auto Diesel",,,1,,
,,,,,,,,,,,,,,,,,,,,,,,,,,,,,,,,,,,,,,,,,
Get the complete dataset from,,,,,,,,,,,,,,,,,,,,,,,,,,,,,,,,,,,,,,,,,
https://www.locationscloud.com/product/speedway-gas-station-locations-in-the-usa/,,,,,,,,,,,,,,,,,,,,,,,,,,,,,,,,,,,,,,,,,
